{"text_format":"1","workbook":"xlsx","n_sheets":11,"sheets":["WKS1_EVAL","WKS2_MINCOST","WKS3_OPTCOST","WKS4_TTCOSTSAV","WKS5_VOCSAV","WKS6_CRASHSAV","WKS7_INTANGIBLE","WKS8_OVERALL_SCORE","CFG_ValidationTables","CFG_LookupTables","CFG_Constants"],"not_rendered":{"charts":0,"images":0,"macros":1,"external_links":0,"defined_names":83,"comments":0,"pivot_tables":0},"unopened":[],"bounds":{"document_bytes":16777216,"sheet_cells":100000,"rows_first":2000,"rows_last":500,"rows_between":2000,"halvings":0,"cell_chars":16384,"cell_head_chars":4096},"cells_cut":0,"cells_raw":0,"read":"whole","date_system":"1900"}

{"sheet":"WKS1_EVAL","index":0,"n_rows":53,"n_cols":9,"rows_kept":53,"cut":false,"hidden":false,"merged":[[2,1,2,9],[9,1,9,9],[16,1,16,9],[28,1,28,9],[14,3,14,5],[11,3,11,5],[13,3,13,5],[18,3,18,5],[22,3,22,5],[4,3,4,5],[5,3,5,5],[6,3,6,5],[7,3,7,5],[12,3,12,5],[38,1,38,9],[42,1,42,9],[47,1,47,9],[20,1,20,9],[24,4,24,9],[24,1,24,2],[26,3,26,5],[30,3,30,5],[31,3,31,5]]}
["Worksheet 1 - Project Description"]
[]
[1,"Applicant's Details"]
[]
[null,"Organisation Name",null,null,null,null,null,"Legend"]
[null,"MRRG Reference",null,null,null,null,null,null,"Calculated value"]
[null,"Assessor(s) name and position",null,null,null,null,null,null,"Free-text user input"]
[null,"Reviewer(s) name and position",null,null,null,null,null,null,"Dropdown selection"]
[]
[2,"Project Overview"]
[]
[null,"Project Name"]
[null,"Project Type",null,"Isolated intersection/intersection as part of route improvement"]
[null,"Mid-block section/intersection under consideration (SLKs)"]
[null,"Road Type",null,"District Distributor A"]
[]
[3,"Problem Description"]
[]
[null,"Describe issue/problems to be addressed"]
[]
{"$rows_left_out":34}
{"sheet":"WKS2_MINCOST","index":1,"n_rows":40,"n_cols":9,"rows_kept":40,"cut":false,"hidden":false,"merged":[[2,1,2,3],[2,8,2,9],[37,1,37,9],[27,1,27,9],[4,1,4,9],[8,1,8,9],[2,4,2,7],[10,4,10,7],[24,6,24,7],[17,6,17,7],[18,6,18,7],[19,6,19,7],[20,6,20,7],[21,6,21,7],[22,6,22,7],[23,6,23,7]]}
["Worksheet 2 - Cost of the Do-minimum"]
[]
[1,"Road Type",null,null,{"$f":"WKS1_EVAL!D15","v":"District Distributor A"}]
[]
[2,"PV of annual maintenance costs"]
[]
[null,null,null,null,null,{"$f":"\"x \" & DISCOUNTFACTOR_PV_DOMIN","v":"x 11.7023"},null,{"$f":"E7*DISCOUNTFACTOR_PV_DOMIN","v":0},"(a)"]
[]
[3,"PV of periodic maintenance costs"]
[]
[null,"Proposed Rehab treatment measure",null,null,{"$f":"VLOOKUP(E3, CFG_LookupTables!A103:B107, 2, FALSE)","v":"40mm SMA overlay"}]
[null,"Rehab treatment cost",null,null,null,null,null,{"$f":"VLOOKUP(E11, CFG_LookupTables!A91:B100, 2, FALSE)","v":21.5}]
[null,"Site treatment area (from SLK to SLK)",null,null,null,null,null,null,"m2"]
[null,"Rehab cost",null,null,null,null,null,{"$f":"H12*H13","v":0}]
[]
[null,"Periodic maintenance will be required in the following years:"]
[]
[null,null,"Year","Type of Maintenance","Required?","Estimated Cost","SPPWF",null,"PV"]
[null,null,5,{"$f":"$E$11","v":"40mm SMA overlay"},"N/A",{"$f":"$H$14","v":0},{"$f":"IF(ISNA(VLOOKUP(C19, LUT_SPPWF, 2, FALSE)), \"\", VLOOKUP(C19, LUT_SPPWF, 2, FALSE))","v":0.68},null,{"$f":"IF(E19 = \"Yes\", IF(ISNUMBER(G19), F19*G19, \"\"), \"N/A\")","v":"N/A"}]
[null,null,10,"40mm SMA overlay",{"$f":"IF($E$3 = \"Primary Distributor\", \"Yes\", \"N/A\")","v":"N/A"},0,0.46400000000000002,null,"N/A"]
{"$rows_left_out":21}
{"sheet":"WKS3_OPTCOST","index":2,"n_rows":48,"n_cols":9,"rows_kept":48,"cut":false,"hidden":false,"merged":[[2,1,2,3],[2,8,2,9],[28,6,28,7],[29,6,29,7],[30,6,30,7],[2,4,2,7],[18,4,18,7],[25,6,25,7],[26,6,26,7],[27,6,27,7],[4,1,4,9],[8,1,8,9],[12,1,12,9],[16,1,16,9],[45,1,45,9],[35,1,35,9],[31,6,31,7]]}
["Worksheet 3 - Cost of the Option"]
[]
[1,"Road Type",null,null,{"$f":"WKS1_EVAL!D15","v":"District Distributor A"}]
[]
[2,"PV of estimated cost of proposed work (as per attached estimate sheet)"]
[]
[null,null,null,null,null,{"$f":"\"x \" & \"0.9259\"","v":"x 0.9259"},null,{"$f":"E7*0.9259","v":0},"(a)"]
[]
[3,"PV of routine maintenance costs following completion of the work"]
[]
[null,null,null,null,null,{"$f":"\"x \" & DISCOUNTFACTOR_PV_OPT","v":"x 10.7398"},null,{"$f":"E11*DISCOUNTFACTOR_PV_OPT","v":0},"(b)"]
[]
[4,"PV of maintenance cost in year 1"]
[]
[null,null,null,null,null,null,null,{"$f":"WKS2_MINCOST!E7","v":0},"(c)"]
[]
[5,"PV of Option periodic maintenance cost"]
[]
[null,"Proposed Rehab treatment measure",null,null,{"$f":"VLOOKUP(E3, CFG_LookupTables!A103:B107, 2, FALSE)","v":"40mm SMA overlay"}]
[null,"Rehab treatment cost",null,null,null,null,null,{"$f":"VLOOKUP(E19, CFG_LookupTables!A91:B100, 2, FALSE)","v":21.5}]
{"$rows_left_out":29}
{"sheet":"WKS4_TTCOSTSAV","index":3,"n_rows":62,"n_cols":20,"rows_kept":62,"cut":false,"hidden":false,"merged":[[59,1,59,21],[46,1,46,21],[31,1,31,21],[16,1,16,21],[2,1,2,2],[4,1,4,2],[6,1,6,2],[6,6,6,21],[4,8,4,21],[2,8,2,21],[4,3,4,7],[2,3,2,7],[18,2,18,6],[34,2,34,3],[19,7,19,10],[19,2,19,3],[6,3,6,5],[9,3,9,7],[9,9,9,13],[8,1,8,21],[33,15,34,18],[18,15,19,18],[19,11,19,14],[18,7,18,10],[18,11,18,14],[34,7,34,10],[33,7,33,10],[34,11,34,14],[33,11,33,14],[61,7,61,8],[34,4,34,5],[19,4,19,5],[53,7,53,8],[54,3,54,4],[54,5,54,6],[54,7,54,8],[52,3,52,4],[52,5,52,6],[52,7,52,8],[33,2,33,6],[57,7,57,8],[48,3,48,8],[55,3,55,4],[53,3,53,4],[53,5,53,6],[57,3,57,4],[57,5,57,6],[55,5,55,6],[55,7,55,8],[56,3,56,4],[56,5,56,6],[56,7,56,8]]}
["Worksheet 4 - Travel Time Cost Savings"]
[]
[1,"Road Type",null,{"$f":"WKS1_EVAL!D15","v":"District Distributor A"}]
[]
[2,"Project Type",null,{"$f":"WKS1_EVAL!D13","v":"Isolated intersection/intersection as part of route improvement"}]
[]
[3,"Modelling Period Type",null,"AM / Inter / PM peak periods"]
[]
[4,"Midblock Assessment - Traffic Volumes"]
[null,null,null,"DO MINIMUM",null,null,null,null,null,"OPTION"]
[null,null,null,"Time Zero (veh/hr)","Year 2","Year 8","Year 15","Year 30",null,"Time Zero (veh/hr)","Year 2","Year 8","Year 15","Year 30"]
[null,null,"AM Peak",null,{"$f":"+((1+WKS1_EVAL!$D$52)^2)*$D12","v":{"$error":"#VALUE!"}},{"$f":"+((1+WKS1_EVAL!$D$52)^8)*$D12","v":{"$error":"#VALUE!"}},{"$f":"+((1+WKS1_EVAL!$D$52)^15)*$D12","v":{"$error":"#VALUE!"}},{"$f":"+G12","v":{"$error":"#VALUE!"}},null,null,{"$f":"+((1+WKS1_EVAL!$D$52)^2)*$J12","v":{"$error":"#VALUE!"}},{"$f":"+((1+WKS1_EVAL!$D$52)^8)*$J12","v":{"$error":"#VALUE!"}},{"$f":"+((1+WKS1_EVAL!$D$52)^15)*$J12","v":{"$error":"#VALUE!"}},{"$f":"+M12","v":{"$error":"#VALUE!"}}]
[null,null,"Interpeak",null,{"$f":"+((1+WKS1_EVAL!$D$52)^2)*$D13","v":{"$error":"#VALUE!"}},{"$f":"+((1+WKS1_EVAL!$D$52)^8)*$D13","v":{"$error":"#VALUE!"}},{"$f":"+((1+WKS1_EVAL!$D$52)^15)*$D13","v":{"$error":"#VALUE!"}},{"$f":"+G13","v":{"$error":"#VALUE!"}},null,null,{"$f":"+((1+WKS1_EVAL!$D$52)^2)*$J13","v":{"$error":"#VALUE!"}},{"$f":"+((1+WKS1_EVAL!$D$52)^8)*$J13","v":{"$error":"#VALUE!"}},{"$f":"+((1+WKS1_EVAL!$D$52)^15)*$J13","v":{"$error":"#VALUE!"}},{"$f":"+M13","v":{"$error":"#VALUE!"}}]
[null,null,"PM Peak",null,{"$f":"+((1+WKS1_EVAL!$D$52)^2)*$D14","v":{"$error":"#VALUE!"}},{"$f":"+((1+WKS1_EVAL!$D$52)^8)*$D14","v":{"$error":"#VALUE!"}},{"$f":"+((1+WKS1_EVAL!$D$52)^15)*$D14","v":{"$error":"#VALUE!"}},{"$error":"#VALUE!"},null,null,{"$f":"+((1+WKS1_EVAL!$D$52)^2)*$J14","v":{"$error":"#VALUE!"}},{"$f":"+((1+WKS1_EVAL!$D$52)^8)*$J14","v":{"$error":"#VALUE!"}},{"$f":"+((1+WKS1_EVAL!$D$52)^15)*$J14","v":{"$error":"#VALUE!"}},{"$f":"+M14","v":{"$error":"#VALUE!"}}]
[null,null,"AADT All periods",null,{"$f":"+((1+WKS1_EVAL!$D$52)^2)*$D15","v":{"$error":"#VALUE!"}},{"$f":"+((1+WKS1_EVAL!$D$52)^8)*$D15","v":{"$error":"#VALUE!"}},{"$f":"+((1+WKS1_EVAL!$D$52)^15)*$D15","v":{"$error":"#VALUE!"}},{"$f":"+G15","v":{"$error":"#VALUE!"}},null,null,{"$f":"+((1+WKS1_EVAL!$D$52)^2)*$J15","v":{"$error":"#VALUE!"}},{"$f":"+((1+WKS1_EVAL!$D$52)^8)*$J15","v":{"$error":"#VALUE!"}},{"$f":"+((1+WKS1_EVAL!$D$52)^15)*$J15","v":{"$error":"#VALUE!"}},{"$f":"+M15","v":{"$error":"#VALUE!"}}]
[]
[5,"Do-minimum Modelling"]
[]
[null,null,"5A Project Timings from Annualisation Factors",null,null,null,null,"5B Isolated Intersection",null,null,null,"5C Road Midblock Improvement",null,null,null,"5D Annual Travel Time Cost ($/year)"]
[null,null,null,null,"Time Periods",null,"TTC","Modelling Results Inputs (veh.hr/hr)",null,null,null,"Modelling Results Inputs (veh.hr/hr)"]
{"$rows_left_out":43}
{"sheet":"WKS5_VOCSAV","index":4,"n_rows":127,"n_cols":26,"rows_kept":127,"cut":false,"hidden":false,"merged":[[2,3,2,7],[4,3,4,7],[6,3,6,5],[10,6,11,9],[25,2,25,5],[26,4,26,5],[10,2,10,5],[11,4,11,5],[19,2,19,5],[19,6,19,9],[6,1,6,2],[4,1,4,2],[2,1,2,2],[2,8,2,18],[4,8,4,18],[6,6,6,18],[8,3,8,18],[23,1,23,2],[23,3,23,18],[25,6,26,9],[34,6,34,9],[34,2,34,5],[56,7,57,7],[56,8,57,8],[56,9,57,9],[49,1,49,18],[80,1,80,22],[54,3,54,6],[55,3,55,6],[55,7,55,10],[55,11,55,14],[68,5,69,5],[56,5,57,5],[67,7,67,10],[56,10,57,10],[56,4,57,4],[68,3,69,3],[68,6,69,6],[56,12,57,12],[56,13,57,13],[86,11,86,14],[87,11,88,11],[87,9,88,9],[87,10,88,10],[68,4,69,4],[54,7,54,10],[85,3,85,6],[85,7,85,10],[68,7,69,7],[68,8,69,8],[68,9,69,9],[68,10,69,10],[56,14,57,14],[68,14,69,14],[56,6,57,6],[67,3,67,6],[56,11,57,11],[66,7,66,10],[66,3,66,6],[67,11,67,14],[68,11,69,11],[68,12,69,12],[68,13,69,13],[56,3,57,3],[126,7,126,8],[119,3,119,4],[120,3,120,4],[121,3,121,4],[119,5,119,6],[122,3,122,4],[122,5,122,6],[122,7,122,8],[121,5,121,6],[119,7,119,8],[120,7,120,8],[121,7,121,8],[124,1,124,18],[118,3,118,4],[118,5,118,6],[120,5,120,6],[118,7,118,8],[86,3,86,6],[98,3,98,6],[87,3,88,3],[87,4,88,4],[87,6,88,6],[87,7,88,7],[87,8,88,8],[87,5,88,5],[99,6,100,6],[97,3,97,6],[99,4,100,4],[99,5,100,5],[99,3,100,3],[99,7,100,7],[99,8,100,8],[97,7,97,10],[98,7,98,10],[99,10,100,10],[111,1,111,18],[86,7,86,10],[113,3,113,8],[117,3,117,4],[117,5,117,6],[117,7,117,8],[99,14,100,14],[99,13,100,13],[99,12,100,12],[99,11,100,11],[87,13,88,13],[98,11,98,14],[99,9,100,9],[87,12,88,12],[87,14,88,14]]}
["Worksheet 5 - VOC and CO2 Cost Savings",null,null,null,null,null,null,null,null,null,null,null,null,null,null,null,null,null,null,null,null,"Look up values"]
[null,null,null,null,null,null,null,null,null,null,null,null,null,null,null,null,null,null,null,null,null,{"$f":"IF($D$3=\"District Distributor A\",4,IF($D$3=\"District Distributor B\",2))","v":4},"Road Roughness Lookup Column "]
[1,"Road Type",null,{"$f":"WKS1_EVAL!D15","v":"District Distributor A"},null,null,null,null,null,null,null,null,null,null,null,null,null,null,null,null,null,{"$f":"IF($D$3=\"District Distributor A\",2,IF($D$3=\"District Distributor B\",2))","v":2},"VOC Lookup Column"]
[null,null,null,null,null,null,null,null,null,null,null,null,null,null,null,null,null,null,null,null,null,"Road Roughness"]
[2,"Project Type",null,{"$f":"WKS1_EVAL!D13","v":"Isolated intersection/intersection as part of route improvement"},null,null,null,null,null,null,null,null,null,null,null,null,null,null,null,null,null,null,null,"Do Minimum","Option"]
[null,null,null,null,null,null,null,null,null,null,null,null,null,null,null,null,null,null,null,null,null,"Roughness Type",null,"IRI","IRI","Dropdown"]
[3,"Modelling Period Type",null,{"$f":"WKS4_TTCOSTSAV!D7","v":"AM / Inter / PM peak periods"},null,null,null,null,null,null,null,null,null,null,null,null,null,null,null,null,null,"IRI Count",null,3,3,"Dropdown"]
[null,null,null,null,null,null,null,null,null,null,null,null,null,null,null,null,null,null,null,null,null,"NAASRA Count",null,119,106,"Dropdown"]
[4,"Do-minimum Traffic Flow",null,"MID BLOCK ONLY",null,null,null,null,null,null,null,null,null,null,null,null,null,null,null,null,null,"Cents/km",null,{"$f":"IF(X6 = \"IRI\", VLOOKUP(WKS5_VOCSAV!X7,LUT_RoughnessCost, V2+1, TRUE), VLOOKUP(WKS5_VOCSAV!X8,CFG_LookupTables!$B$111:$E$123, V2, TRUE))","v":0},{"$f":"IF(Y6 = \"IRI\", VLOOKUP(WKS5_VOCSAV!Y7,LUT_RoughnessCost, V2+1, TRUE), VLOOKUP(WKS5_VOCSAV!Y8,CFG_LookupTables!$B$111:$E$123, V2, TRUE))","v":0},{"$f":"IF($D$3=\"Access Road\", 4, IF($D$3=\"Distributor A or B\",2,IF($D$3=\"Local Distributor / Industrial Road\",3)))","v":false}]
[]
[null,null,"4A Project timings from Annualisation Factors",null,null,null,"4B Traffic Flow Data (veh/hr)"]
[null,null,null,null,"Time periods"]
[null,null,"Time Period","Flow Factor","Time periods (hrs/day)","Days/year","Year 2","Year 8","Year 15","Year 30"]
[null,null,"Weekday AM Peak",{"$f":"WKS4_TTCOSTSAV!D22","v":1},{"$f":"WKS4_TTCOSTSAV!E22","v":2},{"$f":"WKS4_TTCOSTSAV!F22","v":245},{"$f":"WKS4_TTCOSTSAV!E12","v":{"$error":"#VALUE!"}},{"$f":"WKS4_TTCOSTSAV!F12","v":{"$error":"#VALUE!"}},{"$f":"WKS4_TTCOSTSAV!G12","v":{"$error":"#VALUE!"}},{"$f":"WKS4_TTCOSTSAV!H12","v":{"$error":"#VALUE!"}},"(a)"]
[null,null,"Weekday Interpeak",{"$f":"WKS4_TTCOSTSAV!D23","v":1},{"$f":"WKS4_TTCOSTSAV!E23","v":8},{"$f":"WKS4_TTCOSTSAV!F23","v":245},{"$f":"WKS4_TTCOSTSAV!E13","v":{"$error":"#VALUE!"}},{"$f":"WKS4_TTCOSTSAV!F13","v":{"$error":"#VALUE!"}},{"$f":"WKS4_TTCOSTSAV!G13","v":{"$error":"#VALUE!"}},{"$f":"WKS4_TTCOSTSAV!H13","v":{"$error":"#VALUE!"}},"(b)"]
[null,null,"Weekday PM Peak",{"$f":"WKS4_TTCOSTSAV!D24","v":1},{"$f":"WKS4_TTCOSTSAV!E24","v":2},{"$f":"WKS4_TTCOSTSAV!F24","v":245},{"$f":"WKS4_TTCOSTSAV!E14","v":{"$error":"#VALUE!"}},{"$f":"WKS4_TTCOSTSAV!F14","v":{"$error":"#VALUE!"}},{"$f":"WKS4_TTCOSTSAV!G14","v":{"$error":"#VALUE!"}},{"$f":"WKS4_TTCOSTSAV!H14","v":{"$error":"#VALUE!"}},"(c)"]
[null,null,"Weekday Off Peak",{"$f":"WKS4_TTCOSTSAV!D25","v":0.25},{"$f":"WKS4_TTCOSTSAV!E25","v":12},{"$f":"WKS4_TTCOSTSAV!F25","v":245},{"$f":"$D17*WKS4_TTCOSTSAV!E$13","v":{"$error":"#VALUE!"}},{"$f":"$D17*WKS4_TTCOSTSAV!F$13","v":{"$error":"#VALUE!"}},{"$f":"$D17*WKS4_TTCOSTSAV!G$13","v":{"$error":"#VALUE!"}},{"$f":"$D17*WKS4_TTCOSTSAV!H$13","v":{"$error":"#VALUE!"}},"(d)"]
[null,null,"Weekend Peak",{"$f":"WKS4_TTCOSTSAV!D26","v":0.45},{"$f":"WKS4_TTCOSTSAV!E26","v":8},{"$f":"WKS4_TTCOSTSAV!F26","v":120},{"$f":"$D18*WKS4_TTCOSTSAV!E$13","v":{"$error":"#VALUE!"}},{"$f":"$D18*WKS4_TTCOSTSAV!F$13","v":{"$error":"#VALUE!"}},{"$f":"$D18*WKS4_TTCOSTSAV!G$13","v":{"$error":"#VALUE!"}},{"$f":"$D18*WKS4_TTCOSTSAV!H$13","v":{"$error":"#VALUE!"}},"(e)"]
[null,null,"Weekend Off Peak",{"$f":"WKS4_TTCOSTSAV!D27","v":0.15},{"$f":"WKS4_TTCOSTSAV!E27","v":16},{"$f":"WKS4_TTCOSTSAV!F27","v":120},{"$f":"$D19*WKS4_TTCOSTSAV!E$13","v":{"$error":"#VALUE!"}},{"$f":"$D19*WKS4_TTCOSTSAV!F$13","v":{"$error":"#VALUE!"}},{"$f":"$D19*WKS4_TTCOSTSAV!G$13","v":{"$error":"#VALUE!"}},{"$f":"$D19*WKS4_TTCOSTSAV!H$13","v":{"$error":"#VALUE!"}},"(f)"]
[null,null,null,null,null,null,"AADT (veh/day)"]
{"$rows_left_out":108}
{"sheet":"WKS6_CRASHSAV","index":5,"n_rows":35,"n_cols":5,"rows_kept":35,"cut":false,"hidden":false,"merged":[[32,1,32,6],[22,1,22,6],[26,1,26,6],[18,1,18,6],[11,1,11,6],[6,1,9,5],[13,1,16,5],[2,2,2,3],[2,4,2,6],[4,1,4,6]]}
["Worksheet 6 - Crash Cost Savings"]
[]
[1,"Project Type",{"$f":"WKS1_EVAL!D13","v":"Isolated intersection/intersection as part of route improvement"}]
[]
[2,"Crash Summary"]
[]
[]
[]
[]
[]
[]
[3,"Counter Measures"]
[]
[]
[]
[]
[]
[]
[4,"Net PV of Crash Cost Savings (from CARS)"]
[]
{"$rows_left_out":16}
{"sheet":"WKS7_INTANGIBLE","index":6,"n_rows":42,"n_cols":5,"rows_kept":42,"cut":false,"hidden":false,"merged":[[2,1,2,4],[9,1,9,4],[39,1,39,4],[7,2,7,3],[16,1,16,4],[23,1,23,4],[21,2,21,3],[30,2,30,3],[14,2,14,3],[26,3,28,3],[32,1,32,4],[37,2,37,3]]}
["Worksheet 7 - Non Tangible Benefits"]
[]
[1,"Public Transport"]
[]
[null,"Effect","Description","Score"]
[null,"Neutral",{"$f":"VLOOKUP($B6, CFG_LookupTables!$A$213:$C$217, 2, FALSE)","v":"No expected change on overall public transport performance with no specific new/upgraded public transport infrastructure provided or removed."},{"$f":"VLOOKUP($B6, CFG_LookupTables!$A$213:$C$217, 3, FALSE)","v":0}]
[]
[null,"Justification"]
[]
[2,"Pedestrian Facilities"]
[]
[null,"Effect","Description","Score"]
[null,"Neutral",{"$f":"VLOOKUP($B13, CFG_LookupTables!$A$197:$C$201, 2, FALSE)","v":"No expected change on overall pedestrian levels of service with no specific walking infrastructure improvements provided or existing facilities removed."},{"$f":"VLOOKUP($B13, CFG_LookupTables!$A$197:$C$201, 3, FALSE)","v":0}]
[]
[null,"Justification"]
[]
[3,"Cycling Facilities"]
[]
[null,"Effect","Description","Score"]
[null,"Neutral",{"$f":"VLOOKUP($B20, CFG_LookupTables!A204:C209, 2, FALSE)","v":"No expected change on overall cycling levels of service with no specific cycling infrastructure improvements provided or existing facilities removed."},{"$f":"VLOOKUP($B20, CFG_LookupTables!A204:C209, 3, FALSE)","v":0}]
{"$rows_left_out":23}
{"sheet":"WKS8_OVERALL_SCORE","index":7,"n_rows":35,"n_cols":10,"rows_kept":35,"cut":false,"hidden":false,"merged":[[2,1,2,10],[6,1,6,10],[21,1,21,10],[28,1,28,10],[32,1,32,10],[16,1,16,10],[10,1,10,10]]}
["Worksheet 8 - Overall Score"]
[]
[1,"Present Value (PV) cost of Do-minimum"]
[]
[null,null,null,{"$f":"WKS2_MINCOST!H40","v":0},"A worksheet 2"]
[]
[2,"Present Value (PV) cost of Option"]
[]
[null,null,null,{"$f":"WKS3_OPTCOST!H48","v":0},"B worksheet 3"]
[]
[3,"Unconstrained Benefit values"]
[]
[null,"PV travel time cost savings",null,{"$f":"WKS4_TTCOSTSAV!H62","v":0},"C worksheet 4","x update factor TTC",{"$f":"UPDATEFACTOR_TTC","v":1.27},null,{"$f":"D13*G13","v":0},"W"]
[null,"PV VOC and CO2 savings",null,{"$f":"IFERROR(WKS5_VOCSAV!H127,\"\")","v":""},"D worksheet 5","x update factor VOC",{"$f":"UPDATEFACTOR_VOC","v":1.27},null,{"$f":"IFERROR(D14*G14,\"\")","v":""},"Y"]
[null,"PV Crash cost savings",null,{"$f":"IFERROR(WKS6_CRASHSAV!D35,\"\")","v":""},"E worksheet 6","x update factor AC",{"$f":"UPDATEFACTOR_AC","v":1.27},null,{"$f":"IFERROR(D15*G15,\"\")","v":""},"Z"]
[]
[4,"Ratio of Unconstrained Benefit to Cost"]
[]
[null,"PV net unconstrained benefits / PV net costs",null,null,"(W + Y + Z) / (B - A)",{"$f":"IFERROR(SUM(I13:I15)/(D9-D5),\"\")","v":""}]
[null,"Score",null,null,null,{"$f":"IFERROR(MIN(SUM(I13:I15)/(D9-D5), 50),\"\")","v":""}]
{"$rows_left_out":16}
{"sheet":"CFG_ValidationTables","index":8,"n_rows":133,"n_cols":3,"rows_kept":133,"cut":false,"hidden":true,"merged":[]}
["Dropdown Box Validation Lookup Tables"]
["All lookup tables that will be used throughout the tool for dropdown box validation must be defined here."]
["Note: Each lookup table Named Range must be prefixed by LUT_ so that they will be grouped in the Excel Name Manager."]
[]
["Lookup Table Description","Lookup Table Values","Used By"]
["Location selection method","Intersection","WKS6_CRASHSAV"]
[null,"Road-section"]
[null,"Mid-block"]
[]
["Intersection location selection method","Intersection detail","WKS6_CRASHSAV"]
[null,"Locus detail"]
[]
["Boolean","Yes"]
[null,"No"]
[]
["Road Environment","Built-up Road","WKS6_CRASHSAV"]
[null,"Open Road"]
[null,"All Roads"]
[]
["Crash Cost & Cost Savings Method","Nature - Built Up","WKS6_CRASHSAV"]
{"$rows_left_out":114}
{"sheet":"CFG_LookupTables","index":9,"n_rows":249,"n_cols":14,"rows_kept":249,"cut":false,"hidden":true,"merged":[[243,0,244,0],[243,1,244,1]]}
["VLookup Tables"]
["All lookup tables that will be used throughout the tool for VLOOKUPS must be defined here."]
["Note: Each lookup table Named Rangemust be prefixed by LUT_ so that they will be grouped in the Excel Name Manager."]
[]
["Single Payment Present Worth Factor SPPWF (for 8 % discount rate)"]
["Year","SPPWF"]
[1,0.93]
[2,0.86]
[3,0.79]
[4,0.74]
[5,0.68]
[6,0.63]
[7,0.57999999999999996]
[8,0.54]
[9,0.5]
[10,0.46400000000000002]
[11,0.43]
[12,0.4]
[13,0.37]
[14,0.34]
{"$rows_left_out":230}
{"sheet":"CFG_Constants","index":10,"n_rows":36,"n_cols":5,"rows_kept":36,"cut":false,"hidden":true,"merged":[]}
["Model Constants"]
["This table contains the numerical constants that are used throughout the formulae in the tool."]
["Note: Each magic number should describe any calculations used to define the number, or a reference to the place it was obtained from."]
[]
["Value","Code","Used By","Description","Reference"]
[117.1,"CPI_PA_2002","WKS5_VOCSAV","Perth CPI sub index for motor vehicle parts and accessories at June 2002","Australian Bureau of Statistics (2011) Historical record of CPI and sub indexes.  www.abs.gov.au/AUSSTATS/abs@.nsf/DetailsPage/6401.0Dec%202010?OpenDocument\n"]
[105.3,"CPI_MV_2002","WKS5_VOCSAV","Perth CPI sub index for motor vehicles  at June 2002","Australian Bureau of Statistics (2011) Historical record of CPI and sub indexes.  www.abs.gov.au/AUSSTATS/abs@.nsf/DetailsPage/6401.0Dec%202010?OpenDocument\n"]
[11.4,"NCP","WKS5_VOCSAV","Percentage of Australian car fleet that are new  in %","Australian Bureau of Statistics (2010) Motor Vehicle Census. 9309.0. "]
[88.6,"UCP","WKS5_VOCSAV","Percentage of Australian car fleet that are used in %","Australian Bureau of Statistics (2010) Motor Vehicle Census. 9309.0. "]
[71.900000000000006,"RTP","WKS5_VOCSAV","Percentage of Australian heavy vehicle fleet that are rigid trucks in %","Australian Bureau of Statistics (2002) Survey of Motor Vehicle Use. 9208.0."]
[13.7,"ATP","WKS5_VOCSAV","Percentage of Australian heavy vehicle fleet that  are articulated trucks in %","Australian Bureau of Statistics (2002) Survey of Motor Vehicle Use. 9208.0."]
[14.4,"BP","WKS5_VOCSAV","Percentage of Australian hevay vehicle fleet that are buses in %","Australian Bureau of Statistics (2002) Survey of Motor Vehicle Use. 9208.0."]
[41.2,"PP_2002","WKS5_VOCSAV","2002 resource petrol price in c/l","Austroads (2004) Economic Evaluation of Road Investment Proposals, Unit Values for Road User Costs at June 2002. AP-R241."]
[45.4,"DP_2002","WKS5_VOCSAV","2002 resource diesel price  in c/l","Austroads (2004) Economic Evaluation of Road Investment Proposals, Unit Values for Road User Costs at June 2002. AP-R241."]
[{"$f":"1/9.4","v":0.10638297872340426},"LPKM_C","WKS5_VOCSAV","Approximate fuel use rate for passenger cars in litres/km"]
[{"$f":"1/7.48","v":0.13368983957219249},"LPKM_L","WKS5_VOCSAV","Approximate fuel use rate for LCV's in litres/km"]
[{"$f":"1/5.74","v":0.17421602787456444},"LPKM_H","WKS5_VOCSAV","Approximate fuel use rate for HCV/BUS's in litres/km"]
[0.37,"F_P_L","WKS5_VOCSAV","(Petrol-powered LCV fuel-consumption as percentage of (petrol and diesel)-powered LCV fuel -consumption)/100"]
[0.43,"f_HCVI_EEM","WKS5_VOCSAV","Fraction of the Australian heavy vehicle fleet comprised of HCVI's"]
[0.42,"f_HCVII_EEM","WKS5_VOCSAV","Fraction of the Australian heavy vehicle fleet comprised of HCVII's"]
{"$rows_left_out":16}