{"text_format":"1","workbook":"xlsx","n_sheets":7,"sheets":["Instructions","Matrix","Project Information","Credit Reporting ","Initiatives","Revised Data","Theme, Categories, Credits"],"not_rendered":{"charts":0,"images":1,"macros":1,"external_links":0,"defined_names":10,"comments":0,"pivot_tables":0},"unopened":[],"bounds":{"document_bytes":16777216,"sheet_cells":100000,"rows_first":2000,"rows_last":500,"rows_between":2000,"halvings":0,"cell_chars":16384,"cell_head_chars":4096},"cells_cut":0,"cells_raw":0,"read":"whole","date_system":"1900"}

{"sheet":"Instructions","index":0,"n_rows":39,"n_cols":13,"rows_kept":39,"cut":false,"hidden":false,"merged":[[14,6,15,7],[14,0,15,0],[19,1,19,4],[19,6,19,7],[21,0,21,9],[17,0,17,9],[18,0,18,9],[38,5,38,9],[38,0,38,4],[9,1,9,3],[9,6,9,7],[11,0,11,9],[23,0,23,9],[37,0,37,9],[36,0,36,9],[24,0,24,9],[12,0,13,9],[33,0,33,2],[33,3,33,9],[34,0,34,2],[34,3,34,9],[14,1,15,4],[14,5,15,5],[0,0,1,9],[8,1,8,3],[3,1,3,3],[5,1,5,6],[7,1,7,3],[7,6,7,7],[23,12,25,20],[22,12,22,20],[26,12,26,20],[27,12,29,20],[35,0,35,9],[26,0,26,9],[27,0,27,9],[30,0,30,2],[30,3,30,9],[31,0,31,2],[31,3,31,9],[28,0,28,9],[29,0,29,9],[22,0,22,9],[25,0,25,9]]}
["MAJOR PROJECTS: MONTHLY SUSTAINABILITY PROGRESS REPORT\n"]
[]
["Contractor Details"]
["Contractor","[NAME]",null,null,null,"Month","[MMM]","Year","[YYYY]"]
[]
["Project","[NAME]",null,null,null,null,null,"Contract #"]
[]
["Prepared by","[NAME]",null,null,null,"Region","[REGION]"]
[]
["Sustainability Lead","[NAME]",null,null,null,"Planning/Design/As Built"]
[]
["DECLARATION"]
["I hereby declare that the answers given in this report describe our current Company's performance for the Contract and contract period stated above.  I acknowledge the right of Main Roads to further verify our stated performance by audit."]
[]
["Name ","[NAME]",null,null,null,"Date","[DATE]"]
[]
[]
["MAIN ROADS APPROVAL"]
["The Main Roads Representative has received and approved information in this report, and this information provides an accurate representation for the project. "]
["Name (Main Roads Representative)","[NAME]",null,null,null,"Date","[DATE]"]
{"$rows_left_out":20}
{"sheet":"Matrix","index":1,"n_rows":59,"n_cols":10,"rows_kept":59,"cut":false,"hidden":false,"merged":[[3,8,4,8],[43,3,43,4],[44,3,46,4],[47,9,49,9],[50,9,52,9],[33,3,33,7],[44,6,46,8],[43,5,43,8],[44,9,46,9],[44,2,46,2],[47,2,49,2],[50,2,52,2],[53,2,55,2],[3,1,4,1],[3,2,4,2],[33,1,34,2],[35,1,39,1],[43,1,58,1],[56,2,58,2],[24,1,29,1],[56,9,58,9],[56,3,58,4],[53,3,55,4],[47,3,49,4],[50,3,52,4],[50,6,50,8],[51,6,51,8],[52,6,52,8],[47,6,49,8],[56,6,56,8],[57,6,57,8],[58,6,58,8],[53,6,53,8],[54,6,54,8],[53,9,55,9],[55,6,55,8]]}
["Matrix"]
["Opportunity Impact Criteria"]
[]
[null,"Level of Benefit Rating (Impact)","Design / Specification (Resource impact)","Cost","Time / Schedule","Local Supply Chain Content","Aboriginal Supply Chain / Employment","Customer Reputation","Environment / Heritage"]
[null,null,null,"(Financial)","(Financial)","(Non-financial)","(Non-financial)","(Non-financial)"]
[null,"Significant","-       Reduces material, energy or water consumption by >10%.","-       Return on investment <5 years.","-       Efficiency >10% of schedule saving.","-       Builds new local supply chain capability","-       Builds new Aboriginal supply chain capability.","-       Significant increase in reputation / positive state-wide engagement ","-       Significant enhancement of ecological or heritage values."]
[null,5,null,"OR",null,"-       Local content >50%.","-       Aboriginal Content >10%.","-       State-wide positive sentiment","OR"]
[null,null,null,"-       Efficiency >1.5% of contract value.",null,null,"-       >10% Aboriginal employment.","-       Consistent State-wide positive media attention","-       Significant positive residual effect environmental and heritage values of the area."]
[null," Major ","-       - Reduces material, energy or water consumption by >5%.","-       Return on investment 5 - 9 years.","-       Efficiency >5% of schedule saving.","-       Creates additional flexibility chain capability ","-       Creates additional flexibility or reinforces Aboriginal Supply Chain.","-       Positive Perth Metro engagement / reputation.","-       Substantial reduction/avoidance of negative impacts across a large portion of the project or isolated enhancement."]
[null,4,null,"OR",null,"-       Local content >25%.","-       Aboriginal Content >5%","-       Creates positive political sentiment.","OR"]
[null,null,null,"-       Efficiency >1.0-1.5% of contract value.",null,null,"-       5-10% increase Aboriginal employment.","-       State-wide positive media attention lasting days.","-       Substantial positive residual effect on local environmental and heritage values of the area."]
[null,"Moderate ","-       Reduces material, energy or water consumption by >2%.","-       Return on investment 10-14 years.","-       Efficiency >2% of schedule savings.","-       Reinforces local supply chain capability","-       Aboriginal Content >3%","-       Increase of confidence and trust by community and stakeholders in agency processes and capability.","-       Reduction in negative impacts across a large portion of the project."]
[null,3,null,"OR",null,"-       Local content >10%.","-       3-5% increase Aboriginal employment.","Once-off State positive media attention.","OR"]
[null,null,null,"-       Efficiency >0.5-1.0% of contract value.",null,null,null,null,"-       Medium term positive residual effect on environmental and heritage values of the area."]
[null,"Minor ","-       Reduces material, energy or water consumption by >1%.","-       Return on investment 15-20 years.","-       Efficiency >1% of schedule savings.","-       Local content >5%.","-       Aboriginal Content >1%","-       Increased positive sentiment.","-       Significant reduction in negative impacts to an isolated area."]
[null,2,null,"OR",null,null,"-       1-2% increase Aboriginal employment.","One-off significant increase of confidence/ trust by community and stakeholders in agency processes and capability.","OR"]
[null,null,null,"-       Efficiency >0.1-0.5% of contract value.",null,null,null,"-       State Government accolade.","-       Short-term positive residual effect on environmental and heritage values of the area."]
[null,null,null,null,null,null,null,"-       Occasional positive localised community media attention. "]
[null,"Insignificant ","-       Reduces material, energy or water consumption by <1%.","-       Return on investment >20 years.","-       Efficiency <1% of schedule savings.","-       Local content <5%.","-       Aboriginal Supply / Content <1%","-       Creates isolated local community or individualised engagement and positivity / ideas.","-       Minimal reduction in negative impacts to isolated area."]
[null,1,null,"OR",null,null,"-       0-1% increase Aboriginal employment e.g. traineeship, apprenticeship, direct and indirect employment).  ","-       Increased directly affected stakeholder positive sentiment.","OR"]
{"$rows_left_out":40}
{"sheet":"Project Information","index":2,"n_rows":42,"n_cols":4,"rows_kept":42,"cut":false,"hidden":false,"merged":[[75,10,76,10],[75,11,76,11],[0,0,0,1],[0,3,0,4],[2,3,21,3],[23,3,24,3],[25,3,41,3]]}
["PROJECT INFORMATION",null,null,"GENERAL COMMENTS"]
[]
["Name of Project",{"$f":"Instructions!B6","v":"[NAME]"}]
["Contract Number",{"$f":"Instructions!I6","v":0}]
["Date Project Awarded"]
["Link to the IS SharePoint site"]
[]
["Contact Person for Report",{"$f":"Instructions!B15","v":"[NAME]"}]
["Project Sustainability Lead",{"$f":"Instructions!B10","v":"[NAME]"}]
["Current Main Roads Project Director"]
["Current Main Roads Representative",{"$f":"Instructions!B20","v":"[NAME]"}]
["Contract Value of Project"]
["Month of Reporting Period",{"$f":"Instructions!G4","v":"[MMM]"}]
["Date of Report",{"$f":"Instructions!G15","v":"[DATE]"}]
[]
["IS Technical Manual Version Used"]
["Rating Assessment"]
["Current Rating Phase"]
["Contractual Target Score"]
["Stretch Target Score"]
{"$rows_left_out":23}
{"sheet":"Credit Reporting ","index":3,"n_rows":1,"n_cols":17,"rows_kept":1,"cut":false,"hidden":false,"merged":[]}
["Theme","Category","Technical Manual Used for Credit","Credit ","Contractually Mandated","Contract Mandatory Minimum","Current Tasks and Actions","Issues and Risks","Lessons Learnt","Status Update","Risk of Not Achieving","Materiality Score","Maximum Score Possible","Target Level","Target Score","Tracking Level","Tracking Score"]

{"sheet":"Initiatives","index":4,"n_rows":100,"n_cols":17,"rows_kept":100,"cut":false,"hidden":false,"merged":[]}
["Reference Code","Initiative Title ","Initiative Description","Expected Outcomes","Associated IS Credit","Category Tag","Contractually Mandated","Effort","Impact","Rating","Date Completed","Status Update","Current Tasks and Actions","Issues and Risks","Lessons Learnt","Upfront Project Associated Costs","Project Life Associated Costs"]
[null,null,null,null,null,null,null,null,null,{"$f":"VLOOKUP(H2,Matrix!$C$36:$H$40,HLOOKUP(I2,Matrix!$D$35:$H$41,7,FALSE),FALSE)","v":{"$error":"#N/A"}}]
[null,null,null,null,null,null,null,null,null,{"$f":"VLOOKUP(H3,Matrix!$C$36:$H$40,HLOOKUP(I3,Matrix!$D$35:$H$41,7,FALSE),FALSE)","v":{"$error":"#N/A"}}]
[null,null,null,null,null,null,null,null,null,{"$f":"VLOOKUP(H4,Matrix!$C$36:$H$40,HLOOKUP(I4,Matrix!$D$35:$H$41,7,FALSE),FALSE)","v":{"$error":"#N/A"}}]
[null,null,null,null,null,null,null,null,null,{"$f":"VLOOKUP(H5,Matrix!$C$36:$H$40,HLOOKUP(I5,Matrix!$D$35:$H$41,7,FALSE),FALSE)","v":{"$error":"#N/A"}}]
[null,null,null,null,null,null,null,null,null,{"$f":"VLOOKUP(H6,Matrix!$C$36:$H$40,HLOOKUP(I6,Matrix!$D$35:$H$41,7,FALSE),FALSE)","v":{"$error":"#N/A"}}]
[null,null,null,null,null,null,null,null,null,{"$f":"VLOOKUP(H7,Matrix!$C$36:$H$40,HLOOKUP(I7,Matrix!$D$35:$H$41,7,FALSE),FALSE)","v":{"$error":"#N/A"}}]
[null,null,null,null,null,null,null,null,null,{"$f":"VLOOKUP(H8,Matrix!$C$36:$H$40,HLOOKUP(I8,Matrix!$D$35:$H$41,7,FALSE),FALSE)","v":{"$error":"#N/A"}}]
[null,null,null,null,null,null,null,null,null,{"$f":"VLOOKUP(H9,Matrix!$C$36:$H$40,HLOOKUP(I9,Matrix!$D$35:$H$41,7,FALSE),FALSE)","v":{"$error":"#N/A"}}]
[null,null,null,null,null,null,null,null,null,{"$f":"VLOOKUP(H10,Matrix!$C$36:$H$40,HLOOKUP(I10,Matrix!$D$35:$H$41,7,FALSE),FALSE)","v":{"$error":"#N/A"}}]
[null,null,null,null,null,null,null,null,null,{"$f":"VLOOKUP(H11,Matrix!$C$36:$H$40,HLOOKUP(I11,Matrix!$D$35:$H$41,7,FALSE),FALSE)","v":{"$error":"#N/A"}}]
[null,null,null,null,null,null,null,null,null,{"$f":"VLOOKUP(H12,Matrix!$C$36:$H$40,HLOOKUP(I12,Matrix!$D$35:$H$41,7,FALSE),FALSE)","v":{"$error":"#N/A"}}]
[null,null,null,null,null,null,null,null,null,{"$f":"VLOOKUP(H13,Matrix!$C$36:$H$40,HLOOKUP(I13,Matrix!$D$35:$H$41,7,FALSE),FALSE)","v":{"$error":"#N/A"}}]
[null,null,null,null,null,null,null,null,null,{"$f":"VLOOKUP(H14,Matrix!$C$36:$H$40,HLOOKUP(I14,Matrix!$D$35:$H$41,7,FALSE),FALSE)","v":{"$error":"#N/A"}}]
[null,null,null,null,null,null,null,null,null,{"$f":"VLOOKUP(H15,Matrix!$C$36:$H$40,HLOOKUP(I15,Matrix!$D$35:$H$41,7,FALSE),FALSE)","v":{"$error":"#N/A"}}]
[null,null,null,null,null,null,null,null,null,{"$f":"VLOOKUP(H16,Matrix!$C$36:$H$40,HLOOKUP(I16,Matrix!$D$35:$H$41,7,FALSE),FALSE)","v":{"$error":"#N/A"}}]
[null,null,null,null,null,null,null,null,null,{"$f":"VLOOKUP(H17,Matrix!$C$36:$H$40,HLOOKUP(I17,Matrix!$D$35:$H$41,7,FALSE),FALSE)","v":{"$error":"#N/A"}}]
[null,null,null,null,null,null,null,null,null,{"$f":"VLOOKUP(H18,Matrix!$C$36:$H$40,HLOOKUP(I18,Matrix!$D$35:$H$41,7,FALSE),FALSE)","v":{"$error":"#N/A"}}]
[null,null,null,null,null,null,null,null,null,{"$f":"VLOOKUP(H19,Matrix!$C$36:$H$40,HLOOKUP(I19,Matrix!$D$35:$H$41,7,FALSE),FALSE)","v":{"$error":"#N/A"}}]
[null,null,null,null,null,null,null,null,null,{"$f":"VLOOKUP(H20,Matrix!$C$36:$H$40,HLOOKUP(I20,Matrix!$D$35:$H$41,7,FALSE),FALSE)","v":{"$error":"#N/A"}}]
{"$rows_left_out":81}
{"sheet":"Revised Data","index":5,"n_rows":98,"n_cols":12,"rows_kept":98,"cut":false,"hidden":true,"merged":[]}
[null,null,null,null,null,null,null,null,null,"Tags","Tag","Simpler"]
[null,null,null,null,"Contractually Mandated (D)",null,"Type (B)",null,null,null,"Adaptability","Design"]
[null,null,null,null,"Not Mandatory",null,"Improvement",null,null,null,"Air Quality ","Environmental Discharges"]
[null,null,null,null,"Mandatory",null,"Initiative",null,null,null,"Asphalt","Resources"]
[null,null,null,"Theme (A3)/A",null,null,"Innovation",null,null,null,"Barriers","Road Elements & Facilities"]
[null,"IS Technical Manual Used (A11)",null,"Governance",null,null,null,null,null,null,"Buy Local","Procurement"]
[null,"Planning (Version 2.0)",null,"Economic","Contract Minimum (E)",null,null,null,null,null,"Carbon Sequestration","Energy"]
[null,"Design and As Built (Version 2.0)",null,"Environmental","Level 1",null,null,null,null,null,"Circular Economy","Resource Efficiency"]
[null,"Design and As Built  (Version 2.1)",null,"Social ","Level 2",null,null,null,null,null,"Climate Change Adaptation","Resilience"]
[null,"Design and As Built Approved Trial (Version 2.0 & 2.1)",null,null,"Level 3",null,null,null,null,null,"Community and Stakeholder Engagement","Stakeholder Engagement"]
[null,"IS Essentials (Version 2.1)",null,"Technical Manual Used for Credit (B3)","5% Reduction",null,null,null,null,null,"Concrete Mixes","Resources"]
[null,null,null,"Planning Version 2.0","10% Reduction",null,null,null,null,null,"Connectivity","Design"]
[null,"Rating Type (A12)",null,"Design & AsBuilt Version 2.0","15% Reduction",null,null,null,null,null,"Conservation ","Environment"]
[null,"Self Assessment",null,"Design & AsBuilt Version 2.1","20% Reduction",null,null,null,null,null,"Construction - Temporary Works","Construction"]
[null,"Formal Assessment",null,"IS Essentials Version 2.1",null,null,null,null,null,null,"Construction Methodology","Construction"]
[null,"IS Essentials Assessment",null,null,null,null,null,null,null,null,"Cyclists & Pedestrian Facilities","Road Elements & Facilities"]
[null,null,null,null,"Status Update (I)",null,null,null,null,null,"Decision Making","Leadership & Processes"]
[null,"Current Rating Phase (A13)",null,null,"Complete","0,176,240",null,null,null,null,"Design - Drainage","Design"]
[null,"Planning",null,null,"On Track","146,208,80",null,null,null,null,"Design - Durability","Design"]
[null,"Design",null,null,"Proposed","255,255,0",null,null,null,null,"Design - Pavement","Design"]
{"$rows_left_out":79}
{"sheet":"Theme, Categories, Credits","index":6,"n_rows":47,"n_cols":14,"rows_kept":47,"cut":false,"hidden":true,"merged":[]}
["Theme",null,null,null,null,null,null,"Planning Version 2.0","DAB Version 2.0","DAB Version 2.1","IS Essentials Version 2.1"]
[null,null,"Governance","Economic","Environmental ","Social",null,"Con-1 Strategic Context (Version 2.0)","Con-2 Urban and Landscape Design Context (V2.0)","Pla-2 Urban and Landscape Design (V2.1)","Lea-1 Integrating Sustainability (V2.1)",null,"Con-1 Strategic Context ","Con-1  "]
["Governance",{"$f":"COUNTA(OFFSET($C$2,1,MATCH('Credit Reporting '!$A2,$C$2:$F$2,0)-1,7))","v":1},"Context","Options Assessment & Business Case","Energy & Carbon","Stakeholder Engagement",null,"Con-2 Urban and Landscape Design Context (V2.0)","Lea-1 Integrating Sustainability (V2.0)","Lea-1 Integrating Sustainability (V2.1)","Lea-2 Risks and Opportunities (V2.1)",null,"Con-2 Urban and Landscape Design Context","Con-2 "]
[null,null,"Leadership & Management","Benefits","Green Infrastructure","Legacy",null,"Lea-1 Integrating Sustainability (V2.0)","Lea-2 Risks and Opportunities (V2.0)","Lea-2 Risks and Opportunities (V2.1)","Lea-3 Knowledge Sharing (V2.0)",null,"Ecn-1 Options Assessment","Ecn-1 "]
[null,null,"Risks and Opportunities",null,"Environmental Impacts","Heritage",null,"Lea-2 Risks and Opportunities (V2.0)","Lea-3 Knowledge Sharing (V2.0)","Lea-3 Knowledge Sharing (V2.0)","Spr-1 Sustainable Procurement Strategy (V2.1)",null,"Ecn-2 Valuing and Considering Externalities ","Ecn-2 "]
[null,null,"Knowledge Sharing",null,"Resource Efficiency","Workforce Sustainability",null,"Lea-3 Knowledge Sharing (V2.0)","Spr-1 Risk and Opportunity Assessment and Procurement Strategy (V2.0)","Spr-1 Sustainable Procurement Strategy (V2.1)","Spr-2 Supplier Assessment and Selection (V2.1)",null,"Ecn-3 Equity and Distributional Impacts","Ecn-3 "]
[null,null,"Sustainable Procurement",null,"Water",null,null,"Spr-1 Risk and Opportunity Assessment and Procurement Strategy (V2.0)","Spr-2 Supplier Assessment and Selection (V2.0)","Spr-2 Supplier Assessment and Selection (V2.1)","Spr-3 Contract and Supplier Management (V2.1)",null,"Ecn-4 Economic and Financial Sustainability","Ecn-4 "]
[null,null,"Resilience",null,"Ecology",null,null,"Spr-2 Supplier Assessment and Selection (V2.0)","Spr-3 Contract and Supplier Management (V2.0)","Spr-3 Contract and Supplier Management (V2.1)","Res-1 Climate and Natural Hazard Risks (V2.1)",null,"Ecn-4/Ecn-5 Benefits Mapping","Ecn-5 "]
[null,null,"Innovation",null,null,null,null,"Spr-3 Contract and Supplier Management (V2.0)","Res-1 Resilience Strategy (V2.0)","Res-1 Climate and Natural Hazard Risks (V2.1)","Res-2 Resilience Planning (V2.1)",null,"Eco-1 Ecological Assessment and Risk Management/ Ecological Risk Management and Enhancement","Eco-1 "]
[null,null,null,null,null,null,null,"Res-1 Resilience Strategy (V2.0)","Res-2 Climate and Natural Hazard Risks (V2.0)","Res-2 Resilience Planning (V2.1)","Inn-1 Innovation (V2.1)",null,"Eco-2 Ecological Monitoring","Eco-2"]
[null,null,null,null,null,null,null,"Res-2 Climate and Natural Hazard Risks (V2.0)","Inn-1 Innovation (V2.0)","Inn-1 Innovation (V2.1)","Ecn-1 Options Assessment (V2.1)",null,"Ene-1 Energy Efficiency","Ene-1 "]
[null,null,null,null,null,null,null,"Inn-1 Innovation (V2.0)","Ecn-1 Options Assessment (V2.0)","Ecn-1 Options Assessment (V2.1)","Ene-1 Energy Efficiency (V2.1)",null,"Ene-2 Renewable Energy","Ene-2 "]
["Economic",null,null,null,null,null,null,"Ecn-1 Options Assessment (V2.0)","Ecn-4 Economic and Financial Sustainability (V2.0)","Ecn-4 Benefits Mapping (V2.1)","Ene-2 Renewable Energy (V2.1)",null,"Ene-3 Offsetting","Ene-3 "]
[null,null,null,null,null,null,null,"Ecn-2 Valuing and Considering Externalities (V2.0)","Ecn-5 Benefits Mapping (V2.0)","Ene-1 Energy Efficiency (V2.1)","Ene-3 Offsetting (V2.1)",null,"Env-1 Receiving Water Quality","Env-1 "]
[null,null,null,null,null,null,null,"Ecn-3 Equity and Distributional Impacts (V2.0)","Ene-1 Energy Efficiency (V2.0)","Ene-2 Renewable Energy (V2.1)","Gre-1 Green Infrastructure (V2.1)",null,"Env-2 Noise","Env-2 "]
[null,null,null,null,null,null,null,"Ecn-4 Economic and Financial Sustainability (V2.0)","Ene-2 Renewable Energy (V2.0)","Ene-3 Offsetting (V2.1)","Env-1 Receiving Water Quality (V2.1)",null,"Env-3 Vibration","Env-3 "]
[null,null,null,null,null,null,null,"Ecn-5 Benefits Mapping (V2.0)","Ene-3 Offsetting (V2.0)","Gre-1 Green Infrastructure (V2.1)","Env-2 Noise (V2.1)",null,"Env-4 Air Quality","Env-4"]
[null,null,null,null,null,null,null,"Ene-1 Energy Efficiency (V2.0)","Gre-1 Green Infrastructure (V2.0)","Env-1 Receiving Water Quality (V2.1)","Env-3 Vibration (V2.1)",null,"Env-5 Light Pollution","Env-5"]
["Environmental",null,null,null,null,null,null,"Ene-2 Renewable Energy (V2.0)","Env-1 Receiving Water Quality (V2.0)","Env-2 Noise (V2.1)","Env-4 Air Quality (V2.1)",null,"Gre-1 Green Infrastructure","Gre-1"]
[null,null,null,null,null,null,null,"Ene-3 Offsetting (V2.0)","Env-2 Noise (V2.0)","Env-3 Vibration (V2.1)","Env-5 Light Pollution (V2.1)",null,"Her-1 Heritage Assessment and Monitoring","Her-1"]
{"$rows_left_out":27}