{"text_format":"1","workbook":"xlsx","n_sheets":4,"sheets":["Suitability Audit Assessment","Summary Report","Options","Sheet Names List"],"not_rendered":{"charts":0,"images":1,"macros":1,"external_links":0,"defined_names":0,"comments":0,"pivot_tables":0},"unopened":[],"bounds":{"document_bytes":16777216,"sheet_cells":100000,"rows_first":2000,"rows_last":500,"rows_between":2000,"halvings":0,"cell_chars":16384,"cell_head_chars":4096},"cells_cut":0,"cells_raw":0,"read":"whole","date_system":"1900"}

{"sheet":"Suitability Audit Assessment","index":0,"n_rows":111,"n_cols":7,"rows_kept":111,"cut":false,"hidden":false,"merged":[[1,0,1,5],[3,5,6,6],[7,1,7,2],[2,4,2,5],[3,0,6,2]]}
[]
[" Specification 203 Health and Safety Management (Suitability Assessment)"]
[]
[null,null,null,"Compliant","Compliant - The clause criteria has been achieved and meets the full requirement of the specification clause.","Author's Note: The requirements for secondary assessment of a Contractor's identifiable records is detailed in the Main Roads document Guideline Specification 203 health and safety Management - Suitability and Compliance Audit Requirements."]
[null,null,null,"Partial Compliance","Partially Compliant - The clause criteria has only partially achieved the requirement of the specification clause."]
[null,null,null,"Non Compliant","Non Compliant - The clause criteria has not achieved the requirement of the specification clause."]
[null,null,null,"Not Applicable"," Not Applicable - The clause criteria is not applicable."]
[]
["Clause No.","Clause","Specification 203 Clause Evaluation Criteria","Initial Assessment Findings","Comments (Initial Suitability Assessment Findings)","Secondary Assessment","Comments (Secondary Audit Findings - where applicable)"]
["203.10 (1)","General Requirements\n1.The Contractor must prepare and submit the Plan which meets the following requirements of this specification, which includes:\n(a) the clauses contained in Part A, Part B and Part C must be addressed in the Plan and submitted in accordance with the headings detailed in Annexure 203D;\n(b) the identifiable records listed in Annexure 203A.2 must be submitted as controlled documents in accordance with SPECIFICATION 201 QUALITY MANAGEMENT;\n(c) the identifiable records must be submitted within the specified time frames in accordance with the submission requirements detailed in this specification (Annexure 203A.1); and\n(d) no work under the Contract is to commence until the Superintendent has approved the identifiable record submission in accordance with the Hold Points.","Has the Contractor detailed the general requirements of the Plan(s) and how they will meet specification requirements as detailed in clause criteria elements a - d ?"]
["203.11 (1)","Scope of Work\n1. The Contractor must detail the scope of work under the Contract, which must include the following information:\na) the name of the Contractor; \nb) the commencement date and duration of the proposed work under the Contract;\nc) the key work processes based on the project management delivery plan / schedule;\nd) features of the Site including terrain, expected weather condition and other specific local features;\ne) the location of material supply or disposal points associated with the Site; and \nf) any work camps, fuel storage facilities, workshops or explosive stores, or similar.","Has the Contractor detailed the scope of works associated with the works under the Contract and detailed criteria elements a - f in the Plan ? "]
["203.12 (1)","Legislative Obligations\nWhere the Contractor is appointed to perform work under the Contract, the Contractor must implement, maintain and demonstrate compliance with all duties of the WHS Act (WA) and all duties of the WHS Regulations (WA) as appointed principal contractor.","Has the Contractor detailed in the Plan compliance to the stated regulatory requirements of the clause criteria?"]
["203.12 (2)","Contractor Requirements \n2. Where the work under the Contract falls under the scope of the Work Health and Safety (Mines) Regulations 2022, the Contractor must meet the requirements of these regulations.","Has the Contractor detailed in the Plan the requirements of the mines regulations where applicable to the works?"]
["203.12 (3)","Contractor Requirements \n2. The Contractor must ensure the health and safety of Workers, the Principal’s Personnel, members of the public and anyone else who may be present on the Site, by providing a working environment that is safe and without risk, so far as is reasonably practicable.","Has the Contractor detailed in the Plan provision of a safe workplace for the mentioned stakeholders, so far as is reasonably practicable ?"]
["203.13 (1)","Compliance\n1. The Contractor must comply with and ensure Workers comply with any acts, regulations, laws and by-laws, Codes of Practice and standards relating to WHS that are applicable to work under the Contract.","Has the Contractor stated Worker compliance to any acts, regulations, laws and by-laws, Codes of Practice and standards relating to WHS ?"]
["203.13 (2)","Compliance\n2. The Contractor must comply with all health and safety policies, procedures or measures implemented or adopted by the occupiers of any premises at or within which the Contractor will perform work under the Contract and comply with all directions of the Superintendent relating to this specification. In the event of any inconsistency, adopt such procedures or measures that produce the higher level of health and safety.","Has the Contractor acknowledged compliance to the clause criteria including the requirement to follow all directions of the Superintendent relating to the specification ?"]
["203.13 (3)","Compliance\n3. Where any specification, standard, procedure, guidance note or similar (Annexure 203A.3) is referenced in this specification for the development of an identifiable record (Annexure 203A.2) or is to be used in association with work under the Contract, the Contractor must follow the requirements detailed in this specification.","Has the Contractor documented they will comply with all the stated requirements of the clause including Annexure 203A.2 (schedule of identifiable records) ?"]
["203.13 (4)","Compliance\n4. In addition to the requirements of the WHS Act (WA) and WHS Regulation (WA), the Contractor must comply with their ISO 45001 WHS Management System accreditation and FSC Accreditation (where accredited) and the requirements of this specification.","Has the Contractor acknowledged compliance with their management system accreditation (ISO45001), their FSC accreditation (where required) and the specification ?"]
["203.14 (1)","\nLeadership, Commitment and Management Responsibility\n1.The Contractor must demonstrate leadership and commitment for successfully managing the health and safety of Workers, the Principal’s Personnel and members of the public who may be affected by work under the Contract.  This commitment can be demonstrated and measured through the following:\n(a) health and safety considerations are integrated in decision making processes for the duration of the work;\n(b) implementing this specification and the conditions of contract relating to health and safety;\n(c) active monitoring health and safety performance and compliance of any Workers; and\n(d) provide appropriate time and resources for measuring, promoting and improving health and safety performance.","Has the Contractor detailed how they will manage WHS for the stated clause stakeholders and the clause criteria elements a - d?"]
["203.14 (2)","Leadership, Commitment and Management Responsibility \n2. The Contractor must detail the health and safety responsibilities of all Workers who have a health and safety responsibility in association with work under the Contract, which must include: \na) the name(s) of the Contractor’s senior Site representative(s); and\nb) include the name(s), qualifications and experience of the Contractor’s appointed WHS Management Representative.","Has the Contractor detailed the WHS roles, responsibilities and accountabilities of all Workers who have an WHS duty, which must also include senior Site representatives ?"]
["203.15 (1)","Consultation, Cooperation, Coordination and Issue Resolution\n1. Upon approval of the Plan by the Superintendent, the Contractor must ensure the Plan is communicated to all Workers, in accordance with Regulations 310 and 311 of the WHS Regulations (WA) and also must ensure the Plan is:\n(a) provided to any Worker upon request;\n(b) understood by all Workers (including through the provision of an induction);\n(c) communicated to Workers when a change has been made to the Plan in accordance with Regulation 311; and\n(d) is made available for inspection upon request by any Worker, the Superintendent, nominated Superintendent’s staff, Auditor or any Regulatory inspector.","Has the Contractor detailed the requirements of clause criteria a - d upon approval of the Plan by the Superintendent ?"]
["203.15 (2)","Consultation, Cooperation, Coordination and Issue Resolution\n2.The Contractor must have consultation, cooperation and coordination arrangements in place to resolve workplace health and safety issues.  This arrangement must also include an issue resolution process.","Has the Contractor detailed consultation, co-operation and co-ordination arrangements, including a resolution process ?"]
["203.15 (3)","Consultation, Cooperation, Coordination and Issue Resolution\n1.The Contractor must have consultation, cooperation and coordination arrangements in place to resolve workplace health and safety issues.  This arrangement must also include an issue resolution process.\n(a) daily pre-start meeting(s) with all Workers, to suit activities that will be completed by the relevant Workers on that day or shift;\n(b) fortnightly toolbox talks on specific health and safety topics applicable to work under the Contract; and\n(c) monthly health and safety committee meetings to discuss relevant health and safety performance with the project management team, WHS Management Representative, supervisory personnel (including those from subcontractors), HSR and select Principal’s Personnel associated with work under the Contract.","Has the Contractor detailed the communication arrangements in clause criteria elements a - c will be implemented for the duration of the Works ?"]
["203.15 (4)","\n\nConsultation, Cooperation, Coordination and Issue Resolution\n4.The Contractor must implement a stop task authority / protocol for the project Site where it is not part of the Contractor’s certified WHS Management System.  The stop task authority / protocol must meet the general requirements of Part 5 Division 6 (right to cease or direct cessation of unsafe work) of the WHS Act (WA).","Has the Contractor detailed the stop task authority / protocol in accordance with Part 5 Division 6 of the clause criteria requirements ?"]
["203.15 (5)","Consultation, Cooperation, Coordination and Issue Resolution\n5.The Contractor must have an Employee Assistance Program (EAP) to support all Workers who may be exposed to psychological hazards or who may require psychological support.  The EAP service must include provision for mental health and wellbeing support.","Has the Contractor detailed the Employee Assistance Program (EAP), including the provision for mental health and wellbeing support ?"]
["203.15 (6)","Consultation, Cooperation, Coordination and Issue Resolution\n6. In association with the EAP service, the Contractor must also ensure:\n(a) the availability and scope of the EAP service is communicated to all Workers during their on-boarding induction;\n(b) the service is communicated and offered to Workers following a Serious Incident or traumatic event;\n(c) the EAP service is integrated into communication and consultation arrangements; and\n(d) information related to mental health topics is regularly communicated to all Workers (e.g. at toolbox talks and pre-start meetings).","Has the Contractor detailed the Employee Assistance Program requirements which are specified in clause criteria elements a - d ?"]
["203.16 (1)","\nSubcontractor Health and Safety Assessent\n1.Prior to engaging a subcontractor who will be performing work under the Contract, the Contractor must complete a health and safety assessment on the subcontractor to ensure the subcontractor is competent to safely carry out the work.  As a minimum, the health and safety assessment must include:\n(a) High Risk Work which is generally undertaken by the subcontractor;\n(b) the training, competency and licensing of the subcontractor’s Workers who are to conduct any High Risk Work;\n(c) consideration of Regulatory improvement notices and any historical or current prosecutions;\n(d) workplace incidents resulting in a death or permanent disability within the last 5 years;\n(e) all SWMS the subcontractor will be operating under for High Risk Work, or any SWMS directed to be used by the Contractor or the Superintendent.","Has the Contractor detailed the clause criteria elements a - e for completing an WHS assessment on subcontractors under their control prior to commencing Works under the Contract ?"]
["203.16 (2)","Subcontractor Health and Safety Assessment \n2. Where a subcontractor is operating under their own safe systems of work, the Contractor must review and approve the subcontractor’s safe systems of work as part of the subcontractor health and safety assessment. This information must be included in the Plan.","Has the Contractor detailed the requirement for completing a review of subcontractor safe systems of work where subcontractors will be operating under their own procedures ?"]
["203.17 (1)","Enclave Areas\n1.Where an enclave area is required on or adjacent to the Site, the Contractor must ensure any specific requirements relating to the enclave area are communicated to all Workers and includes the following information:\n(a) the location and duration of the enclave area;\n(b) any access and egress requirements relating to the enclave area; and\n(c) the nominated Worker who is the point of contact in respect of the enclave area.","Has the Contractor detailed the requirements of clause criteria elements a - c for the communication to Workers relating to an enclave area?"]
["203.17 (2)","Enclave Areas\n2. Any enclave area must be clearly delineated and demarcated from the remainder of the site. ","Has the Contractor detailed the requirements for any enclave area to be clearly delineated and demarcated from the remainder of the site?"]
["203.18 (1)","Personal Protective Equipment\n1.The Contractor must ensure that all Workers have adequate personal protective equipment, which meets the requirements of Part 3.2 Division 5 of the WHS Regulations (WA), relevant Codes of Practice, the Principal’s Minimum WHS Control Standards (Annexure 203A.3) and instructions from manufacturers or suppliers (e.g. safety data sheet).","Has the Contractor detailed that adequate personal protective equipment will be provided to all Workers in accordance with regulatory requirements Part 3.2 Division 2 of the WHS Regulations (WA), relevant Codes of Practice, the Principal's Minimum Control Standards and instructions from manufacturers or suppliers?"]
["203.18 (2)","Personal Protective Equipment\n2.All Workers must wear personal protective clothing which meets the requirements of AS 4602.1 High Visibility Garments.","Has the Contractor detailed the requirement for all Workers to wear personal protective clothing which meets the requirements of AS 4602.1 High Visibility Garments?"]
["203.18 (3)","Personal Protective Equipment\n3. Unless otherwise determined by a task-specific risk assessment, all Workers must wear full torso (long arm and long leg) clothing.  Such risk assessment must clearly outline why the risk of wearing full torso clothing outweighs any benefits that such clothing may provide.","Has the Contractor detailed the requirement for all Workers to wear full torso clothing, unless determined by risk assessment outlining why the risk of wearing full torso clothing outweighs any benefits that such clothing may provide?"]
["203.19 (1)","Testing for Alcohol and Other Drugs \n1. The Contractor must ensure that a drug and alcohol testing regime is in place to test all Workers and any relevant Principal’s Personnel for the presence of alcohol or other drugs for the duration of the work which includes:\na) a random sampling program (drug and alcohol);\nb) post incident sampling (drug and alcohol);\nc) for cause testing on reasonable grounds (drug and alcohol) excluding the Principal’s Personnel;\nd) breath alcohol concentration (BAC) testing on a daily basis prior to any Worker commencing work; \ne) targeted testing for High Risk Work activities (drug and alcohol); and\nf) consideration of any testing of Workers returning for a new work cycle, extended roster or from an extended break (drug and alcohol).","Has the Contractor detailed the clause criteria elements a - f for testing Workers for the presence of drugs or alcohol ?"]
["203.19 (2)","Testing for Alcohol and Other Drugs \n2. The Contractor must use objective testing methods to sample Workers for the presence of alcohol and other drugs of abuse to testing for the presence of alcohol, opiates, tetrahydrocannabinol (THC), cocaine, benzodiazepines, amphetamines and methamphetamine. The testing methods must be in accordance with the following requirements:\na) AS/NZS 4308 Specimen Collection and the Detection and Quantitation of Drugs of Abuse in Urine;\nb) AS/NZS 4760 Specimen Collection and the Detection and Quantification of Drugs in Oral Fluid; and\nc) AS 3547 Breath Alcohol Testing Devices. \nd) as a minimum comply with a testing sample size of 10% of workers.","Has the Contractor detailed the testing for alcohol and other drugs will be conducted in accordance with clause criteria elements a - d ?"]
["203.19 (3)","Testing for Alcohol and Other Drugs \n3. The Contractor must ensure the person who performs the BAC testing and other drug testing, holds the current qualification “Collect Specimens for Drugs of Abuse Testing” from a registered training organisation.","Has the Contractor detailed the qualification requirements of the Worker who will be performing the alcohol and other drug testing ?"]
["203.19 (4)","Testing for Alcohol and Other Drugs \n4. Where a positive reading is received from a secondary BAC test (>0.00) for daily testing, the Worker must be deemed unfit for work and stood down from daily duties and managed in accordance with their Employer’s formal disciplinary / rehabilitation processes and procedures.","Has the Contractor detailed the requirement for stand down of Workers in accordance with the clause criteria for alcohol testing ?"]
["203.19 (5)","Testing for Alcohol and Other Drugs \n5. No Worker is allowed to recommence any form of work until a subsequent testing confirms a negative test result for that Worker.","Has the Contractor detailed the requirement to test negative before recommencing any form of work?"]
["203.19 (7)","Testing for Alcohol and Other Drugs \n7. Where a Worker fails to submit a sample for either alcohol or drugs of abuse for analysis, this must be constituted as a positive test result and the Worker stood down from duties and managed in accordance with their Employer’s disciplinary procedure. Where there is a failure to submit a sample for drugs of abuse testing, the Worker must submit a test for analysis prior to commencing any form of work on the Site.","Has the Contractor detailed the requirements of Worker failure to submit a sample in accordance with the clause criteria ?"]
["203.20 (1).","Management of Fatigue\n1.The Contractor must have systems and procedures in place to manage and control the effects of Worker’s fatigue, which has the potential to lead to and/or contribute to an incident related to work under the Contract.  As a minimum, the Contractor must have a fatigue management system in place which includes:\n(a) identification of the factors which contribute to and increase the risk of Worker fatigue, including work scheduling, roster work, fly in fly out arrangement, job demands, environmental conditions and any non-work related factors that may contribute to fatigue, which transfer to the workplace;\n(b) journey management considerations including daily travel requirements and Worker travel arrangements prior to and post work cycles (e.g. from the Worker’s normal place of residence to Site and vice versa);\n(c) consideration of the location of any temporary accommodation facilities; and\n(d) provision of rest facilities, work/rest cycling or similar to manage Worker fatigue.","Has the Contractor detailed the requirements for the management of fatigue in accordance with clause criteria elements a - d ?"]
{"$rows_left_out":72}
{"sheet":"Summary Report","index":1,"n_rows":34,"n_cols":10,"rows_kept":34,"cut":false,"hidden":false,"merged":[[26,1,26,12],[33,1,33,12],[2,2,2,4],[34,1,45,12],[28,4,31,12],[1,1,1,12],[4,2,4,4],[15,1,25,12],[4,6,4,8],[5,6,5,8],[5,2,5,4],[4,10,4,12],[5,10,5,12],[8,4,12,12],[14,1,14,12],[3,2,3,4],[2,5,3,8],[2,9,3,12]]}
[]
[null,"Specification 203 - Suitability Audit Results"]
[null,"Project:",null,null,null,"Suitability Assessment (Initial Submission)",null,null,null,"Suitability Assessment(Second Submission - where required)"]
[null,"Superintendent:"]
[null,"Contractor:",null,null,null,"Auditor:",null,null,null,"Auditor:"]
[null,"Start Date (works):",null,null,null,"Audit Date:",null,null,null,"Audit Date:"]
[null,"Suitability Assessment Findings (Initial Submission)"]
[]
[null,"Compliant",{"$f":"COUNTIF('Suitability Audit Assessment'!$D$10:$D$111,'Summary Report'!B9)","v":0},{"$f":"C9/ROWS('Suitability Audit Assessment'!$D$10:$D$111)","v":0},"Note to Auditor: For information on assessment criteria and general comments from the initial submission, please refer to the Main Roads document titled, Guideline Specification 203 Safety and Health Management - Suitability and Compliance Audit Requirements"]
[null,"Partial Compliance",{"$f":"COUNTIF('Suitability Audit Assessment'!$D$10:$D$111,'Summary Report'!B10)","v":0},{"$f":"C10/ROWS('Suitability Audit Assessment'!$D$10:$D$111)","v":0}]
[null,"Non Compliant",{"$f":"COUNTIF('Suitability Audit Assessment'!$D$10:$D$111,'Summary Report'!B11)","v":0},{"$f":"C11/ROWS('Suitability Audit Assessment'!$D$10:$D$111)","v":0}]
[null,"Not Applicable",{"$f":"COUNTIF('Suitability Audit Assessment'!$D$10:$D$111,'Summary Report'!B12)","v":11},{"$f":"C12/ROWS('Suitability Audit Assessment'!$D$10:$D$111)","v":0.10784313725490197}]
[null,"Total:",{"$f":"SUM(C9:C12)","v":11},{"$f":"SUM(D9:D12)","v":0.10784313725490197}]
[]
[null,"General Comments (Initial Submission)"]
[]
[]
[]
[]
[]
[]
[]
[]
[]
[]
[]
[null,"Suitability Assessment Findings (Second Submission)"]
[]
[null,"Compliant",110,1,"Note to Auditor: The secondary submission only requires a selection in column \"F\" for clauses which were partially compliant or non compliant from the initial submission.  For information on the second submission of an identifiable records, refer to the Main Roads document titled, Guideline Specification 203 Safety and Health Management - Suitability and Compliance Audit Requirements.                                                                                                                                                                                                                                  "]
[null,"Partial Compliance",{"$f":"COUNTIF('Suitability Audit Assessment'!$F$10:$F$111,'Summary Report'!B30)","v":0},0]
[null,"Non Compliant",{"$f":"COUNTIF('Suitability Audit Assessment'!$F$10:$F$111,'Summary Report'!B31)","v":0},0]
[null,"Total:",{"$f":"SUM(C29:C31)","v":110},1]
[]
[null,"General Comments (Second Submission)"]

{"sheet":"Options","index":2,"n_rows":4,"n_cols":3,"rows_kept":4,"cut":false,"hidden":true,"merged":[]}
["Option Name\n(Do not adjust or change)","Details","Description"]
["Admin Password",123]
["Protect Workbook","Yes","The Workbook will be protected so the user can not Hide/ Unhide sheets, Add or Remove Sheets, or change their names."]
["Protect Worksheets","Yes","All cells in each relevant sheet will be protected (where required) so the user can only change cell data, they also can only alter the sheet format, where permitted."]

{"sheet":"Sheet Names List","index":3,"n_rows":5,"n_cols":3,"rows_kept":5,"cut":false,"hidden":true,"merged":[]}
["Required Sheet Names List","Sheet to be Hidden on Admin","Sheet Always Hidden"]
["Suitability Audit Criteria"]
["Summary Report"]
["Options","Yes"]
["Sheet Names List",null,"Yes"]